Reaction Details
TargetEctonucleotide pyrophosphatase/phosphodiesterase family member 2
LigandBDBM322027
Substrate/Competitorn/a
Meas. Tech.ATX Assay
IC50 3.50±n/a nM
Citation Beattie, DBaettig, ULe Grand, DMLister, ASMcKenna, JPearce, DWSandham, DASteward, ORThomson, C Autotaxin inhibitors US Patent US10183025 Publication Date 1/22/2019
 
Ectonucleotide pyrophosphatase/phosphodiesterase family member 2
Name:Ectonucleotide pyrophosphatase/phosphodiesterase family member 2
Type:Enzyme
Mol. Mass.:99007.13
Organism:Homo sapiens (Human)
Description:Q13822
Residue:863
BDBM322027
NameBDBM322027
Synonyms:(R,E)-3-(4-Chloro-2-((5-methyl-2H-tetrazol-2-yl)methyl)phenyl)-1-(4-((5-methoxypyridin-2-yl)methyl)-2-methylpiperazin-1-yl)prop-2-en-1-one US9763957, Example 123
TypeSmall organic molecule
Emp. Form.C24H28ClN7O2
Mol. Mass.481.978
SMILESCOc1ccc(CN2CCN([C@H](C)C2)C(=O)\C=C\c2ccc(Cl)cc2Cn2nnc(C)n2)nc1