Reaction Details
TargetEctonucleotide pyrophosphatase/phosphodiesterase family member 2
LigandBDBM322061
Substrate/Competitorn/a
Meas. Tech.ATX Assay
IC50 4.90±n/a nM
Citation Beattie, DBaettig, ULe Grand, DMLister, ASMcKenna, JPearce, DWSandham, DASteward, ORThomson, C Autotaxin inhibitors US Patent US10183025 Publication Date 1/22/2019
 
Ectonucleotide pyrophosphatase/phosphodiesterase family member 2
Name:Ectonucleotide pyrophosphatase/phosphodiesterase family member 2
Type:Enzyme
Mol. Mass.:99007.13
Organism:Homo sapiens (Human)
Description:Q13822
Residue:863
BDBM322061
NameBDBM322061
Synonyms:(E)-1-(4-(1-(1H-1,2,3-Triazole-4-carbonyl)piperidin-4-yl)piperazin-1-yl)-3-(4-chloro-2-((5-methyl-2H-tetrazol-2-yl)methyl)phenyl)prop-2-en-1-one US9763957, Example 149
TypeSmall organic molecule
Emp. Form.C24H29ClN10O2
Mol. Mass.525.006
SMILESCc1nnn(Cc2cc(Cl)ccc2\C=C\C(=O)N2CCN(CC2)C2CCN(CC2)C(=O)c2c[nH]nn2)n1