Reaction Details
TargetEctonucleotide pyrophosphatase/phosphodiesterase family member 2
LigandBDBM322062
Substrate/Competitorn/a
Meas. Tech.ATX Assay
IC50 6.90±n/a nM
Citation Beattie, DBaettig, ULe Grand, DMLister, ASMcKenna, JPearce, DWSandham, DASteward, ORThomson, C Autotaxin inhibitors US Patent US10183025 Publication Date 1/22/2019
 
Ectonucleotide pyrophosphatase/phosphodiesterase family member 2
Name:Ectonucleotide pyrophosphatase/phosphodiesterase family member 2
Type:Enzyme
Mol. Mass.:99007.13
Organism:Homo sapiens (Human)
Description:Q13822
Residue:863
BDBM322062
NameBDBM322062
Synonyms:(E)-3-((2-(4-(3-(4-Chloro-2-((5-methyl-2H-tetrazol-2-yl)methyl)phenyl)acryloyl)morpholin-2-yl)ethyl)amino)-4-ethoxycyclobut-3-ene-1,2-dione US9763957, Example 150
TypeSmall organic molecule
Emp. Form.C24H27ClN6O5
Mol. Mass.514.961
SMILESCCOc1c(NCCC2CN(CCO2)C(=O)\C=C\c2ccc(Cl)cc2Cn2nnc(C)n2)c(=O)c1=O