Reaction Details
TargetEctonucleotide pyrophosphatase/phosphodiesterase family member 2
LigandBDBM322068
Substrate/Competitorn/a
Meas. Tech.ATX Assay
IC50 5.30±n/a nM
Citation Beattie, DBaettig, ULe Grand, DMLister, ASMcKenna, JPearce, DWSandham, DASteward, ORThomson, C Autotaxin inhibitors US Patent US10183025 Publication Date 1/22/2019
 
Ectonucleotide pyrophosphatase/phosphodiesterase family member 2
Name:Ectonucleotide pyrophosphatase/phosphodiesterase family member 2
Type:Enzyme
Mol. Mass.:99007.13
Organism:Homo sapiens (Human)
Description:Q13822
Residue:863
BDBM322068
NameBDBM322068
Synonyms:(E)-N-(1-(3-(2-((5-Methyl-2H-tetrazol-2-yl)methyl)-4-(trifluoromethyl)phenyl) acryloyl) piperidin-4-yl)-6-(1H-1,2,3-triazol-5-yl)hexanamide US9763957, Example 156
TypeSmall organic molecule
Emp. Form.C26H32F3N9O2
Mol. Mass.559.5866
SMILESCc1nnn(Cc2cc(ccc2\C=C\C(=O)N2CCC(CC2)NC(=O)CCCCCc2cnn[nH]2)C(F)(F)F)n1