Reaction Details
TargetSerine/threonine-protein kinase B-raf [416-766,V600E]
LigandBDBM322528
Substrate/Competitorn/a
Meas. Tech.LanthaScreen Eu kinase binding assay
IC50<4±n/a nM
Citation Bingham, MTestar, RGignoux, C Fused bicyclic (hetero)aromatic compounds useful for the treatment of cancers US Patent US10183939 Publication Date 1/22/2019
 
Serine/threonine-protein kinase B-raf [416-766,V600E]
Name:Serine/threonine-protein kinase B-raf [416-766,V600E]
Type:n/a
Mol. Mass.:39690.71
Organism:Homo sapiens (Human)
Description:PV3849, from Invitrogen
Residue:351
BDBM322528
NameBDBM322528
Synonyms:5-[3-[4-(3-thienyl)-1H-imidazol-2-yl]chroman-6-yl]oxy-3,4-dihydro-1H-1,8-naphthyridin-2-one USRE49361, Example 6
TypeSmall organic molecule
Emp. Form.C24H20N4O3S
Mol. Mass.444.506
SMILESO=C1CCc2c(Oc3ccc4OCC(Cc4c3)c3nc(c[nH]3)-c3ccsc3)ccnc2N1