Reaction Details
TargetRAF proto-oncogene serine/threonine-protein kinase [Y340D,Y341D]
LigandBDBM322534
Substrate/Competitorn/a
IC50 52±n/a nM
Citation Bingham, MTestar, RGignoux, C Fused bicyclic (hetero)aromatic compounds useful for the treatment of cancers US Patent US10183939 Publication Date 1/22/2019
 
RAF proto-oncogene serine/threonine-protein kinase [Y340D,Y341D]
Name:RAF proto-oncogene serine/threonine-protein kinase [Y340D,Y341D]
Type:Serine/threonine-protein kinase
Mol. Mass.:72984.33
Organism:Homo sapiens (Human)
Description:P04049 Y340D Y341D
Residue:648
BDBM322534
NameBDBM322534
Synonyms:5-[3-[5-(4-methylsulfonylphenyl)-1H-imidazol-2-yl]chroman-6-yl]oxy-3,4-dihydro-1H-1,8-naphthyridin-2-one USRE49361, Example 12
TypeSmall organic molecule
Emp. Form.C27H24N4O5S
Mol. Mass.516.568
SMILESCS(=O)(=O)c1ccc(cc1)-c1cnc([nH]1)C1COc2ccc(Oc3ccnc4NC(=O)CCc34)cc2C1