Reaction Details
TargetRAF proto-oncogene serine/threonine-protein kinase [Y340D,Y341D]
LigandBDBM322529
Substrate/Competitorn/a
IC50 0.500±n/a nM
Citation Bingham, MTestar, RGignoux, C Fused bicyclic (hetero)aromatic compounds useful for the treatment of cancers US Patent US10183939 Publication Date 1/22/2019
 
RAF proto-oncogene serine/threonine-protein kinase [Y340D,Y341D]
Name:RAF proto-oncogene serine/threonine-protein kinase [Y340D,Y341D]
Type:Serine/threonine-protein kinase
Mol. Mass.:72984.33
Organism:Homo sapiens (Human)
Description:P04049 Y340D Y341D
Residue:648
BDBM322529
NameBDBM322529
Synonyms:5-[3-[4-(2-thienyl)-1H-imidazol-2-yl]chroman-6-yl]oxy-3,4-dihydro-1H-1,8-naphthyridin-2-one USRE49361, Example 7
TypeSmall organic molecule
Emp. Form.C24H20N4O3S
Mol. Mass.444.506
SMILESO=C1CCc2c(Oc3ccc4OCC(Cc4c3)c3nc(c[nH]3)-c3cccs3)ccnc2N1