Reaction Details
TargetHistone-lysine N-methyltransferase EZH2
LigandBDBM50149647
Substrate/Competitorn/a
Meas. Tech.Enzyme Assay
IC50 2000±n/a nM
Citation Kuntz, KWOlhava, EJChesworth, RDuncan, KW Substituted 6,5-fused bicyclic heteroaryl compounds US Patent US9637472 Publication Date 5/2/2017
 
Histone-lysine N-methyltransferase EZH2
Name:Histone-lysine N-methyltransferase EZH2
Type:Protein
Mol. Mass.:85367.84
Organism:Homo sapiens (Human)
Description:Q15910
Residue:746
BDBM50149647
NameBDBM50149647
Synonyms:CHEMBL3771291 US9637472, Compound D-71
TypeSmall organic molecule
Emp. Form.C19H22N4O2
Mol. Mass.338.4036
SMILESCC(C)n1ncc2c(cccc12)C(=O)NCc1c(C)cc(C)[nH]c1=O