Reaction Details
TargetDipeptidyl peptidase 4
LigandBDBM11674
Substrate/CompetitorBDBM11057
Meas. Tech.Dipeptidyl Peptidase Inhibition Assay
IC50 19±n/a nM
Citation Xu, JWei, LMathvink, RJEdmondson, SDEiermann, GJHe, HLeone, JFLeiting, BLyons, KAMarsilio, FPatel, RAPatel, SBPetrov, AScapin, GWu, JKThornberry, NAWeber, AE Discovery of potent, selective, and orally bioavailable oxadiazole-based dipeptidyl peptidase IV inhibitors. Bioorg Med Chem Lett16:5373-7 (2006) 
 
Dipeptidyl peptidase 4
Name:Dipeptidyl peptidase 4
Type:Enzyme
Mol. Mass.:88271.01
Organism:Homo sapiens (Human)
Description:P27487
Residue:766
BDBM11674
BDBM11057
NameBDBM11674
Synonyms:(2S,3S)-3-[3-(2-chloro-4-methanesulfonamidophenyl)-1,2,4-oxadiazol-5-yl]-1-(3,3-difluoropyrrolidin-1-yl)-1-oxobutan-2-aminium; 2,2,2-trifluoroacetate oxadiazole based amide
TypeSmall organic molecule
Emp. Form.C17H21ClF2N5O4S
Mol. Mass.464.894
SMILESC[C@@H]([C@H]([NH3+])C(=O)N1CCC(F)(F)C1)c1nc(no1)-c1ccc(NS(C)(=O)=O)cc1Cl