Reaction Details
TargetDipeptidyl peptidase 9
LigandBDBM11677
Substrate/CompetitorBDBM11057
Meas. Tech.Dipeptidyl Peptidase Inhibition Assay
IC50>100000±n/a nM
Citation Xu, JWei, LMathvink, RJEdmondson, SDEiermann, GJHe, HLeone, JFLeiting, BLyons, KAMarsilio, FPatel, RAPatel, SBPetrov, AScapin, GWu, JKThornberry, NAWeber, AE Discovery of potent, selective, and orally bioavailable oxadiazole-based dipeptidyl peptidase IV inhibitors. Bioorg Med Chem Lett16:5373-7 (2006) 
 
Dipeptidyl peptidase 9
Name:Dipeptidyl peptidase 9
Type:Enzyme
Mol. Mass.:98260.70
Organism:Homo sapiens (Human)
Description:Q86TI2
Residue:863
BDBM11677
BDBM11057
NameBDBM11677
Synonyms:(2S,3S)-3-[3-(2-chloro-4-methanesulfonylphenyl)-1,2,4-oxadiazol-5-yl]-1-[(3S)-3-fluoropyrrolidin-1-yl]-5-methyl-1-oxohexan-2-aminium; 2,2,2-trifluoroacetate oxadiazole based amide
TypeSmall organic molecule
Emp. Form.C20H27ClFN4O4S
Mol. Mass.473.969
SMILESCC(C)C[C@@H]([C@H]([NH3+])C(=O)N1CC[C@H](F)C1)c1nc(no1)-c1ccc(cc1Cl)S(C)(=O)=O