Reaction Details
TargetCoagulation factor XI
LigandBDBM330037
Substrate/Competitorn/a
Meas. Tech.Inhibition Assay
Ki 70.0±n/a nM
Citation Neelamkavil, SFEdmondson, SDGuo, ZHruza, AWHussain, ZLesburg, CAMoningka, ROgawa, AKMal, R Factor XIa inhibitors US Patent US9663527 Publication Date 5/30/2017
 
Coagulation factor XI
Name:Coagulation factor XI
Type:Enzyme
Mol. Mass.:70130.58
Organism:Homo sapiens (Human)
Description:P03951
Residue:625
BDBM330037
NameBDBM330037
Synonyms:US9663527, Example 3
TypeSmall organic molecule
Emp. Form.C26H29N6O4
Mol. Mass.489.5457
SMILESCOC(=O)Nc1ccc2-c3c[nH]c(n3)[C@H](CCCCC(=O)Nc2c1)N1Cc2cc(C[NH3+])ccc2C1=O