Reaction Details
TargetCoagulation factor X
LigandBDBM12566
Substrate/CompetitorBDBM12500
Meas. Tech.Factor Xa Inhibition Assay
pH7.8±n/a
Temperature298.15±n/a K
Ki 10±n/a nM
Citation Watson, NSBrown, DCampbell, MChan, CChaudry, LConvery, MAFenwick, RHamblin, JNHaslam, CKelly, HAKing, NPKurtis, CLLeach, ARManchee, GRMason, AMMitchell, CPatel, CPatel, VKSenger, SShah, GPWeston, HEWhitworth, CYoung, RJ Design and synthesis of orally active pyrrolidin-2-one-based factor Xa inhibitors. Bioorg Med Chem Lett16:3784-8 (2006) 
 
Coagulation factor X
Name:Coagulation factor X
Type:Enzyme
Mol. Mass.:54726.60
Organism:Homo sapiens (Human)
Description:n/a
Residue:488
BDBM12566
BDBM12500
NameBDBM12566
Synonyms:6-chloro-N-methyl-N-[(3S)-1-[(2S)-1-(morpholin-4-yl)-1-oxopropan-2-yl]-2-oxopyrrolidin-3-yl]naphthalene-2-sulfonamide pyrrolidin-2-one-based inhibitor 25
TypeSmall organic molecule
Emp. Form.C22H26ClN3O5S
Mol. Mass.479.977
SMILESC[C@H](N1CC[C@H](N(C)S(=O)(=O)c2ccc3cc(Cl)ccc3c2)C1=O)C(=O)N1CCOCC1