Reaction Details
TargetDipeptidyl peptidase 9
LigandBDBM12647
Substrate/CompetitorBDBM11057
Meas. Tech.DPPIV Inhibition Assay
Ki>30000±n/a nM
Citation Madar, DJKopecka, HPireh, DYong, HPei, ZLi, XWiedeman, PEDjuric, SWVon Geldern, TWFickes, MGBhagavatula, LMcDermott, TWittenberger, SRichards, SJLongenecker, KLStewart, KDLubben, THBallaron, SJStashko, MALong, MAWells, HZinker, BAMika, AKBeno, DWKempf-Grote, AJPolakowski, JSegreti, JReinhart, GAFryer, RMSham, HLTrevillyan, JM Discovery of 2-[4-{{2-(2S,5R)-2-cyano-5-ethynyl-1-pyrrolidinyl]-2-oxoethyl]amino]-4-methyl-1-piperidinyl]-4-pyridinecarboxylic acid (ABT-279): a very potent, selective, effective, and well-tolerated inhibitor of dipeptidyl peptidase-IV, useful for the treatment of diabetes. J Med Chem49:6416-20 (2006) 
 
Dipeptidyl peptidase 9
Name:Dipeptidyl peptidase 9
Type:Enzyme
Mol. Mass.:98260.70
Organism:Homo sapiens (Human)
Description:Q86TI2
Residue:863
BDBM12647
BDBM11057
NameBDBM12647
Synonyms:(2S,5R)-5-ethynyl-1-(N-(4-methyl-1-(5-carboxy-pyridin-2-yl)piperidin-4-yl)glycyl)pyrrolidine-2-carbonitrile ABT-279 analogue | C5-substituted pyrrolidine 41
TypeSmall organic molecule
Emp. Form.C21H25N5O3
Mol. Mass.395.4549
SMILESCC1(CCN(CC1)c1ccc(cn1)C(O)=O)NCC(=O)N1[C@H](CC[C@H]1C#N)C#C