Reaction Details
TargetCoagulation factor X
LigandBDBM12707
Substrate/CompetitorBDBM12658
Meas. Tech.Enzyme Assay and Determination of the Inhibition Constants.
pH7±n/a
Temperature295.15±n/a K
Ki 3.0±n/a nM
Citation Fevig, JMCacciola, JBuriak, JRossi, KAKnabb, RMLuettgen, JMWong, PCBai, SAWexler, RRLam, PY Preparation of 1-(4-methoxyphenyl)-1H-pyrazolo[4,3-d]pyrimidin-7(6H)-ones as potent, selective and bioavailable inhibitors of coagulation factor Xa. Bioorg Med Chem Lett16:3755-60 (2006) 
 
Coagulation factor X
Name:Coagulation factor X
Type:Enzyme
Mol. Mass.:54726.60
Organism:Homo sapiens (Human)
Description:n/a
Residue:488
BDBM12707
BDBM12658
NameBDBM12707
Synonyms:6-[2-fluoro-4-(2-methanesulfonylphenyl)phenyl]-1-(4-methoxyphenyl)-5,7-dioxo-1H,4H,5H,6H,7H-pyrazolo[4,3-d]pyrimidine-3-carbonitrile | pyrazolo[4,3-d]pyrimidindione 13
TypeSmall organic molecule
Emp. Form.C26H18FN5O5S
Mol. Mass.531.515
SMILESCOc1ccc(cc1)-n1nc(C#N)c2[nH]c(=O)n(-c3ccc(cc3F)-c3ccccc3S(C)(=O)=O)c(=O)c12