Reaction Details
TargetCoagulation factor X
LigandBDBM12709
Substrate/CompetitorBDBM12658
Meas. Tech.Enzyme Assay and Determination of the Inhibition Constants.
pH7±n/a
Temperature295.15±n/a K
Ki 1.8±n/a nM
Citation Fevig, JMCacciola, JBuriak, JRossi, KAKnabb, RMLuettgen, JMWong, PCBai, SAWexler, RRLam, PY Preparation of 1-(4-methoxyphenyl)-1H-pyrazolo[4,3-d]pyrimidin-7(6H)-ones as potent, selective and bioavailable inhibitors of coagulation factor Xa. Bioorg Med Chem Lett16:3755-60 (2006) 
 
Coagulation factor X
Name:Coagulation factor X
Type:Enzyme
Mol. Mass.:54726.60
Organism:Homo sapiens (Human)
Description:n/a
Residue:488
BDBM12709
BDBM12658
NameBDBM12709
Synonyms:methyl 6-[2-fluoro-4-(2-sulfamoylphenyl)phenyl]-1-(4-methoxyphenyl)-7-oxo-1H,6H,7H-pyrazolo[4,3-d]pyrimidine-3-carboxylate | pyrazolo[4,3-d]pyrimidinone 21
TypeSmall organic molecule
Emp. Form.C26H20FN5O6S
Mol. Mass.549.53
SMILESCOC(=O)c1nn(-c2ccc(OC)cc2)c2c1ncn(-c1ccc(cc1F)-c1ccccc1S(N)(=O)=O)c2=O