Reaction Details
TargetCoagulation factor X
LigandBDBM12725
Substrate/CompetitorBDBM12658
Meas. Tech.Enzyme Assay and Determination of the Inhibition Constants.
Ki 2.1±n/a nM
Citation Fevig, JMCacciola, JBuriak, JRossi, KAKnabb, RMLuettgen, JMWong, PCBai, SAWexler, RRLam, PY Preparation of 1-(4-methoxyphenyl)-1H-pyrazolo[4,3-d]pyrimidin-7(6H)-ones as potent, selective and bioavailable inhibitors of coagulation factor Xa. Bioorg Med Chem Lett16:3755-60 (2006) 
 
Coagulation factor X
Name:Coagulation factor X
Type:Enzyme
Mol. Mass.:54726.60
Organism:Homo sapiens (Human)
Description:n/a
Residue:488
BDBM12725
BDBM12658
NameBDBM12725
Synonyms:3-(1H-imidazol-1-ylmethyl)-1-(4-methoxyphenyl)-5-methyl-6-{4-[2-(pyrrolidin-1-ylmethyl)phenyl]phenyl}-1H,6H,7H-pyrazolo[4,3-d]pyrimidin-7-one | pyrazolo[4,3-d]pyrimidinone 43a
TypeSmall organic molecule
Emp. Form.C34H33N7O2
Mol. Mass.571.6715
SMILESCOc1ccc(cc1)-n1nc(Cn2ccnc2)c2nc(C)n(-c3ccc(cc3)-c3ccccc3CN3CCCC3)c(=O)c12