Reaction Details
TargetCoagulation factor X
LigandBDBM12779
Substrate/CompetitorBDBM12658
Meas. Tech.Enzyme Assay and Determination of the Inhibition Constants.
pH7±n/a
Temperature295.15±n/a K
Ki 26±n/a nM
Citation Batt, DGQiao, JXModi, DPHoughton, GCPierson, DARossi, KALuettgen, JMKnabb, RMJadhav, PKWexler, RR 5-Amidinoindoles as dual inhibitors of coagulation factors IXa and Xa. Bioorg Med Chem Lett14:5269-73 (2004) 
 
Coagulation factor X
Name:Coagulation factor X
Type:Enzyme
Mol. Mass.:54726.60
Organism:Homo sapiens (Human)
Description:n/a
Residue:488
BDBM12779
BDBM12658
NameBDBM12779
Synonyms:(2S)-N-[4-(1H-1,3-benzodiazol-1-yl)-2-fluorophenyl]-2-(5-carbamimidoyl-1H-indol-3-yl)-3-phenylpropanamide 5-amidinoindole 13c
TypeSmall organic molecule
Emp. Form.C31H25FN6O
Mol. Mass.516.5682
SMILESNC(=N)c1ccc2[nH]cc([C@H](Cc3ccccc3)C(=O)Nc3ccc(cc3F)-n3cnc4ccccc34)c2c1