Reaction Details
TargetCoagulation factor X
LigandBDBM12785
Substrate/CompetitorBDBM12658
Meas. Tech.Enzyme Assay and Determination of the Inhibition Constants.
pH7±n/a
Temperature295.15±n/a K
Ki 28±n/a nM
Citation Batt, DGQiao, JXModi, DPHoughton, GCPierson, DARossi, KALuettgen, JMKnabb, RMJadhav, PKWexler, RR 5-Amidinoindoles as dual inhibitors of coagulation factors IXa and Xa. Bioorg Med Chem Lett14:5269-73 (2004) 
 
Coagulation factor X
Name:Coagulation factor X
Type:Enzyme
Mol. Mass.:54726.60
Organism:Homo sapiens (Human)
Description:n/a
Residue:488
BDBM12785
BDBM12658
NameBDBM12785
Synonyms:5-amidinoindole 19 | N-[4-(1H-1,3-benzodiazol-1-yl)-2-fluorophenyl]-2-(5-carbamimidoyl-1H-indol-3-yl)-3-(naphthalen-2-yl)propanamide
TypeSmall organic molecule
Emp. Form.C35H27FN6O
Mol. Mass.566.6269
SMILESNC(=N)c1ccc2[nH]cc(C(Cc3ccc4ccccc4c3)C(=O)Nc3ccc(cc3F)-n3cnc4ccccc34)c2c1