Reaction Details
TargetCoagulation factor X
LigandBDBM12792
Substrate/CompetitorBDBM12658
Meas. Tech.Enzyme Assay and Determination of the Inhibition Constants.
pH7±n/a
Temperature295.15±n/a K
Ki 160±n/a nM
Citation Batt, DGQiao, JXModi, DPHoughton, GCPierson, DARossi, KALuettgen, JMKnabb, RMJadhav, PKWexler, RR 5-Amidinoindoles as dual inhibitors of coagulation factors IXa and Xa. Bioorg Med Chem Lett14:5269-73 (2004) 
 
Coagulation factor X
Name:Coagulation factor X
Type:Enzyme
Mol. Mass.:54726.60
Organism:Homo sapiens (Human)
Description:n/a
Residue:488
BDBM12792
BDBM12658
NameBDBM12792
Synonyms:5-amidinoindole 26 | N-[4-(1H-1,3-benzodiazol-1-yl)-2-fluorophenyl]-2-(5-carbamimidoyl-1-methyl-1H-indol-3-yl)-3-phenylpropanamide
TypeSmall organic molecule
Emp. Form.C32H27FN6O
Mol. Mass.530.5948
SMILESCn1cc(C(Cc2ccccc2)C(=O)Nc2ccc(cc2F)-n2cnc3ccccc23)c2cc(ccc12)C(N)=N