Reaction Details
TargetCoagulation factor X
LigandBDBM12796
Substrate/CompetitorBDBM12658
Meas. Tech.Enzyme Assay and Determination of the Inhibition Constants.
pH7±n/a
Temperature295.15±n/a K
Ki 810±n/a nM
Citation Batt, DGQiao, JXModi, DPHoughton, GCPierson, DARossi, KALuettgen, JMKnabb, RMJadhav, PKWexler, RR 5-Amidinoindoles as dual inhibitors of coagulation factors IXa and Xa. Bioorg Med Chem Lett14:5269-73 (2004) 
 
Coagulation factor X
Name:Coagulation factor X
Type:Enzyme
Mol. Mass.:54726.60
Organism:Homo sapiens (Human)
Description:n/a
Residue:488
BDBM12796
BDBM12658
NameBDBM12796
Synonyms:5-amidinoindole 30 | N-(1H-1,3-benzodiazol-2-yl)-4-{[2-(5-carbamimidoyl-1H-indol-3-yl)-3-phenylpropanamido]methyl}benzamide
TypeSmall organic molecule
Emp. Form.C33H29N7O2
Mol. Mass.555.6291
SMILESNC(=N)c1ccc2[nH]cc(C(Cc3ccccc3)C(=O)NCc3ccc(cc3)C(=O)Nc3nc4ccccc4[nH]3)c2c1