Reaction Details
TargetCoagulation factor X
LigandBDBM12799
Substrate/CompetitorBDBM12658
Meas. Tech.Enzyme Assay and Determination of the Inhibition Constants.
pH7±n/a
Temperature295.15±n/a K
Ki 1100±n/a nM
Citation Batt, DGQiao, JXModi, DPHoughton, GCPierson, DARossi, KALuettgen, JMKnabb, RMJadhav, PKWexler, RR 5-Amidinoindoles as dual inhibitors of coagulation factors IXa and Xa. Bioorg Med Chem Lett14:5269-73 (2004) 
 
Coagulation factor X
Name:Coagulation factor X
Type:Enzyme
Mol. Mass.:54726.60
Organism:Homo sapiens (Human)
Description:n/a
Residue:488
BDBM12799
BDBM12658
NameBDBM12799
Synonyms:4-{[2-(5-carbamimidoyl-1H-indol-3-yl)-3-phenylpropanamido]methyl}-N-(6-methanesulfonyl-1H-1,3-benzodiazol-2-yl)benzamide | 5-amidinoindole 33
TypeSmall organic molecule
Emp. Form.C34H31N7O4S
Mol. Mass.633.719
SMILESCS(=O)(=O)c1ccc2nc(NC(=O)c3ccc(CNC(=O)C(Cc4ccccc4)c4c[nH]c5ccc(cc45)C(N)=N)cc3)[nH]c2c1