Reaction Details
TargetCoagulation factor IX
LigandBDBM12781
Substrate/CompetitorBDBM12774
Meas. Tech.Enzyme Assay and Determination of the Inhibition Constants.
Ki 750±n/a nM
Citation Batt, DGQiao, JXModi, DPHoughton, GCPierson, DARossi, KALuettgen, JMKnabb, RMJadhav, PKWexler, RR 5-Amidinoindoles as dual inhibitors of coagulation factors IXa and Xa. Bioorg Med Chem Lett14:5269-73 (2004) 
 
Coagulation factor IX
Name:Coagulation factor IX
Type:Enzyme
Mol. Mass.:51768.83
Organism:Homo sapiens (Human)
Description:P00740
Residue:461
BDBM12781
BDBM12774
NameBDBM12781
Synonyms:5-amidinoindole 15 | N-[4-(1H-1,3-benzodiazol-1-yl)phenyl]-2-(5-carbamimidoyl-1H-indol-3-yl)-2-methylpropanamide
TypeSmall organic molecule
Emp. Form.C26H24N6O
Mol. Mass.436.5084
SMILESCC(C)(C(=O)Nc1ccc(cc1)-n1cnc2ccccc12)c1c[nH]c2ccc(cc12)C(N)=N