Reaction Details
TargetCoagulation factor IX
LigandBDBM12784
Substrate/CompetitorBDBM12774
Meas. Tech.Enzyme Assay and Determination of the Inhibition Constants.
Ki 240±n/a nM
Citation Batt, DGQiao, JXModi, DPHoughton, GCPierson, DARossi, KALuettgen, JMKnabb, RMJadhav, PKWexler, RR 5-Amidinoindoles as dual inhibitors of coagulation factors IXa and Xa. Bioorg Med Chem Lett14:5269-73 (2004) 
 
Coagulation factor IX
Name:Coagulation factor IX
Type:Enzyme
Mol. Mass.:51768.83
Organism:Homo sapiens (Human)
Description:P00740
Residue:461
BDBM12784
BDBM12774
NameBDBM12784
Synonyms:5-amidinoindole 18 | N-[4-(1H-1,3-benzodiazol-1-yl)-2-fluorophenyl]-2-(5-carbamimidoyl-1H-indol-3-yl)-4-phenylbutanamide
TypeSmall organic molecule
Emp. Form.C32H27FN6O
Mol. Mass.530.5948
SMILESNC(=N)c1ccc2[nH]cc(C(CCc3ccccc3)C(=O)Nc3ccc(cc3F)-n3cnc4ccccc34)c2c1