Reaction Details
TargetCoagulation factor IX
LigandBDBM12787
Substrate/CompetitorBDBM12774
Meas. Tech.Enzyme Assay and Determination of the Inhibition Constants.
Ki 75±n/a nM
Citation Batt, DGQiao, JXModi, DPHoughton, GCPierson, DARossi, KALuettgen, JMKnabb, RMJadhav, PKWexler, RR 5-Amidinoindoles as dual inhibitors of coagulation factors IXa and Xa. Bioorg Med Chem Lett14:5269-73 (2004) 
 
Coagulation factor IX
Name:Coagulation factor IX
Type:Enzyme
Mol. Mass.:51768.83
Organism:Homo sapiens (Human)
Description:P00740
Residue:461
BDBM12787
BDBM12774
NameBDBM12787
Synonyms:3-(4-aminophenyl)-N-[4-(1H-1,3-benzodiazol-1-yl)phenyl]-2-(5-carbamimidoyl-1H-indol-3-yl)propanamide amidinoindole 22
TypeSmall organic molecule
Emp. Form.C31H27N7O
Mol. Mass.513.5924
SMILESNC(=N)c1ccc2[nH]cc(C(Cc3ccc(N)cc3)C(=O)Nc3ccc(cc3)-n3cnc4ccccc34)c2c1