Reaction Details
TargetCoagulation factor IX
LigandBDBM12789
Substrate/CompetitorBDBM12774
Meas. Tech.Enzyme Assay and Determination of the Inhibition Constants.
Ki 270±n/a nM
Citation Batt, DGQiao, JXModi, DPHoughton, GCPierson, DARossi, KALuettgen, JMKnabb, RMJadhav, PKWexler, RR 5-Amidinoindoles as dual inhibitors of coagulation factors IXa and Xa. Bioorg Med Chem Lett14:5269-73 (2004) 
 
Coagulation factor IX
Name:Coagulation factor IX
Type:Enzyme
Mol. Mass.:51768.83
Organism:Homo sapiens (Human)
Description:P00740
Residue:461
BDBM12789
BDBM12774
NameBDBM12789
Synonyms:5-amidinoindole 23 | N-[4-(2-{[4-(1H-1,3-benzodiazol-1-yl)phenyl]carbamoyl}-2-(5-carbamimidoyl-1H-indol-3-yl)ethyl)phenyl]benzamide
TypeSmall organic molecule
Emp. Form.C38H31N7O2
Mol. Mass.617.6984
SMILESNC(=N)c1ccc2[nH]cc(C(Cc3ccc(NC(=O)c4ccccc4)cc3)C(=O)Nc3ccc(cc3)-n3cnc4ccccc34)c2c1