Reaction Details
TargetCoagulation factor X
LigandBDBM12846
Substrate/CompetitorBDBM12658
Meas. Tech.Enzyme Assay and Determination of the Inhibition Constants.
pH7±n/a
Temperature295.15±n/a K
Ki 0.15±n/a nM
Citation Quan, MLHan, QFevig, JMLam, PYBai, SKnabb, RMLuettgen, JMWong, PCWexler, RR Aminobenzisoxazoles with biaryl P4 moieties as potent, selective, and orally bioavailable factor Xa inhibitors. Bioorg Med Chem Lett16:1795-8 (2006) 
 
Coagulation factor X
Name:Coagulation factor X
Type:Enzyme
Mol. Mass.:54726.60
Organism:Homo sapiens (Human)
Description:n/a
Residue:488
BDBM12846
BDBM12658
NameBDBM12846
Synonyms:1-(3-amino-1,2-benzoxazol-5-yl)-N-{2-fluoro-4-[2-(piperidin-1-ylmethyl)phenyl]phenyl}-3-(trifluoromethyl)-1H-pyrazole-5-carboxamide | Aminobenzisoxazole 2o
TypeSmall organic molecule
Emp. Form.C30H26F4N6O2
Mol. Mass.578.5601
SMILESNc1noc2ccc(cc12)-n1nc(cc1C(=O)Nc1ccc(cc1F)-c1ccccc1CN1CCCCC1)C(F)(F)F