Reaction Details
TargetCoagulation factor X
LigandBDBM12852
Substrate/CompetitorBDBM12658
Meas. Tech.Enzyme Assay and Determination of the Inhibition Constants.
pH7±n/a
Temperature295.15±n/a K
Ki 0.02±n/a nM
Citation Quan, MLHan, QFevig, JMLam, PYBai, SKnabb, RMLuettgen, JMWong, PCWexler, RR Aminobenzisoxazoles with biaryl P4 moieties as potent, selective, and orally bioavailable factor Xa inhibitors. Bioorg Med Chem Lett16:1795-8 (2006) 
 
Coagulation factor X
Name:Coagulation factor X
Type:Enzyme
Mol. Mass.:54726.60
Organism:Homo sapiens (Human)
Description:n/a
Residue:488
BDBM12852
BDBM12658
NameBDBM12852
Synonyms:4-{[2-(4-{[1-(3-amino-1,2-benzoxazol-5-yl)-3-(trifluoromethyl)-1H-pyrazole-5-]amido}-3-fluorophenyl)phenyl]methyl}-4-methylmorpholin-4-ium bromide | Aminobenzisoxazole 2u
TypeSmall organic molecule
Emp. Form.C30H27F4N6O3
Mol. Mass.595.5668
SMILESC[N+]1(Cc2ccccc2-c2ccc(NC(=O)c3cc(nn3-c3ccc4onc(N)c4c3)C(F)(F)F)c(F)c2)CCOCC1