Reaction Details
TargetHistamine H4 receptor
LigandBDBM50061056
Substrate/Competitorn/a
Meas. Tech.Binding Assay
Ki 2.00±n/a nM
Citation Cai, HChavez, FDunford, PJGreenspan, AJMeduna, SPQuiroz, JASavall, BMTays, KLThurmond, RLWei, JWolin, RLZhang, X Diamino-pyridine, pyrimidine, and pyridazine modulators of the histamine H4 receptor US Patent US9732087 Publication Date 8/15/2017
 
Histamine H4 receptor
Name:Histamine H4 receptor
Type:G Protein-Coupled Receptor (GPCR)
Mol. Mass.:44517.02
Organism:Homo sapiens (Human)
Description:Binding assays were using CHO cells stably expressing hH4R receptors.
Residue:390
BDBM50061056
NameBDBM50061056
Synonyms:CHEMBL3393542 | US9732087, 73
TypeSmall organic molecule
Emp. Form.C13H23N5
Mol. Mass.249.3552
SMILESCCCCNc1nccc(n1)N1CC[C@H](C1)NC