Reaction Details
TargetHistamine H4 receptor
LigandBDBM335449
Substrate/Competitorn/a
Meas. Tech.Binding Assay
Ki 5.90±n/a nM
Citation Cai, HChavez, FDunford, PJGreenspan, AJMeduna, SPQuiroz, JASavall, BMTays, KLThurmond, RLWei, JWolin, RLZhang, X Diamino-pyridine, pyrimidine, and pyridazine modulators of the histamine H4 receptor US Patent US9732087 Publication Date 8/15/2017
 
Histamine H4 receptor
Name:Histamine H4 receptor
Type:G Protein-Coupled Receptor (GPCR)
Mol. Mass.:44517.02
Organism:Homo sapiens (Human)
Description:Binding assays were using CHO cells stably expressing hH4R receptors.
Residue:390
BDBM335449
NameBDBM335449
Synonyms:5-[(3R)-3-(Methylamino)pyrrolidin-1-yl]-N-[(1S,2S,3S,5R)-2,6,6-trimethylbicyclo[3.1.1]hept-3-yl]pyridazin-3-amine | US9732087, 97
TypeSmall organic molecule
Emp. Form.C19H31N5
Mol. Mass.329.4829
SMILESCN[C@@H]1CCN(C1)c1cnnc(NC2C[C@H]3C[C@@H]([C@@H]2C)C3(C)C)c1