Reaction Details
TargetFlap endonuclease 1
LigandBDBM167144
Substrate/Competitorn/a
Meas. Tech.Binding Assay
Ki 1.40±n/a nM
Citation Eccles, WFitzgerald, AEHack, MDHawryluk, NAJones, WMKeith, JMKrawczuk, PLebsack, ADLiu, JMani, NSMcClure, KJMeduna, SPRosen, MD FLAP modulators US Patent US9732093 Publication Date 8/15/2017
 
Flap endonuclease 1
Name:Flap endonuclease 1
Type:PROTEIN
Mol. Mass.:42602.57
Organism:Homo sapiens (Human)
Description:ChEMBL_1517026
Residue:380
BDBM167144
NameBDBM167144
Synonyms:US9073876, 226 | US9732093, Compound 226
TypeSmall organic molecule
Emp. Form.C21H20FN5O2
Mol. Mass.393.4142
SMILESNc1ccnc(Oc2c(F)c(ccc2C2CCC2)-c2cnc3NCCOc3c2)n1