Reaction Details
TargetCatenin beta-1 [138-686]
LigandBDBM335730
Substrate/Competitorn/a
Meas. Tech.AlphaScreen Assay
Ki 3380±610 nM
Citation Ji, HYu, BZhang, MGuo, W Substituted 1H-indazol-1-OL analogs as inhibitors of beta catenin/Tcf protein-protein interactions US Patent US9738628 Publication Date 8/22/2017
 
Catenin beta-1 [138-686]
Name:Catenin beta-1 [138-686]
Type:Protein
Mol. Mass.:60127.24
Organism:Homo sapiens (Human)
Description:aa 138-686
Residue:549
BDBM335730
NameBDBM335730
Synonyms:US9738628, Compound 17
TypeSmall organic molecule
Emp. Form.C8H8N8O
Mol. Mass.232.2021
SMILESOn1nnc2cc(NCc3nn[nH]n3)ccc12