Reaction Details
TargetHistone-lysine N-methyltransferase EZH2
LigandBDBM335713
Substrate/Competitorn/a
Meas. Tech.Histone Methyl Transferase Assay
EC50<500±n/a nM
Citation Kim, KSZhang, LPurandare, AVSeitz, SP Inhibitors of lysine methyl transferase US Patent US9738630 Publication Date 8/22/2017
 
Histone-lysine N-methyltransferase EZH2
Name:Histone-lysine N-methyltransferase EZH2
Type:Protein
Mol. Mass.:85367.84
Organism:Homo sapiens (Human)
Description:Q15910
Residue:746
BDBM335713
NameBDBM335713
Synonyms:4'-((1,1-Dioxidothiomorpholino) methyl)-5-(ethyl(tetrahydro-2H- pyran-4-yl)amino)-4-methyl-N- ((1-methyl-3-oxo-2,3,5,6,7,8- hexahydroisoquinolin-4- yl)methyl)-[1,1'-biphenyl]-3- carboxamide | US9738630, Example 8
TypeSmall organic molecule
Emp. Form.C37H48N4O5S
Mol. Mass.660.866
SMILESCCN(C1CCOCC1)c1cc(cc(C(=O)NCc2c3CCCCc3c(C)[nH]c2=O)c1C)-c1ccc(CN2CCS(=O)(=O)CC2)cc1