Reaction Details
TargetHistone-lysine N-methyltransferase EZH2
LigandBDBM335722
Substrate/Competitorn/a
Meas. Tech.Histone Methyl Transferase Assay
EC50<50±n/a nM
Citation Kim, KSZhang, LPurandare, AVSeitz, SP Inhibitors of lysine methyl transferase US Patent US9738630 Publication Date 8/22/2017
 
Histone-lysine N-methyltransferase EZH2
Name:Histone-lysine N-methyltransferase EZH2
Type:Protein
Mol. Mass.:85367.84
Organism:Homo sapiens (Human)
Description:Q15910
Residue:746
BDBM335722
NameBDBM335722
Synonyms:N-((1,7-Dimethyl-3-oxo-2,3- dihydroisoquinolin-4-yl)methyl)- 5-(ethyl(tetrahydro-2H-pyran-4- yl)amino)-4-methyl-4'- (morpholinomethyl)-[1,1'- biphenyl]-3-carboxamide | US9738630, Example 16
TypeSmall organic molecule
Emp. Form.C38H46N4O4
Mol. Mass.622.7962
SMILESCCN(C1CCOCC1)c1cc(cc(C(=O)NCc2c3ccc(C)cc3c(C)[nH]c2=O)c1C)-c1ccc(CN2CCOCC2)cc1