Reaction Details
TargetTyrosine-protein kinase Mer
LigandBDBM50384602
Substrate/Competitorn/a
Meas. Tech.Inhibition Assay
IC50<10±n/a nM
Citation Wang, XLiu, JYang, CZhang, WFrye, SKireev, D Pyrazolopyrimidine compounds for the treatment of cancer US Patent US9744172 Publication Date 8/29/2017
 
Tyrosine-protein kinase Mer
Name:Tyrosine-protein kinase Mer
Type:PROTEIN
Mol. Mass.:110234.77
Organism:Homo sapiens (Human)
Description:ChEMBL_1498723
Residue:999
BDBM50384602
NameBDBM50384602
Synonyms:CHEMBL2036795 | US9744172, Compound UNC00000344A
TypeSmall organic molecule
Emp. Form.C22H30N6
Mol. Mass.378.5138
SMILESCCCCNc1ncc2c(nn(CC3CCC(N)CC3)c2n1)-c1ccccc1