Reaction Details
TargetNuclear receptor ROR-gamma
LigandBDBM332524
Substrate/Competitorn/a
Meas. Tech.Biochemical TR-FRET Assay
IC50 1.000±n/a nM
Citation Barr, KJBienstock, CEMaclean, JKZhang, HBeresis, RTZhang, DAnthony, NJLapointe, BTTian, Y 4-heteroaryl substituted benzoic acid compounds as RORgammaT inhibitors and uses thereof US Patent US9745265 Publication Date 8/29/2017
 
Nuclear receptor ROR-gamma
Name:Nuclear receptor ROR-gamma
Type:PROTEIN
Mol. Mass.:58133.31
Organism:Mus musculus
Description:ChEMBL_103664
Residue:516
BDBM332524
NameBDBM332524
Synonyms:4-(1-(2-chloro-6- (trifluoromethyl)benzoyl)-6- (3-methoxy-azetidine-1- carbonyl)-1H-indol-3-yl)-3- fluorobenzoic acid US9745265, 36B
TypeSmall organic molecule
Emp. Form.C28H19ClF4N2O5
Mol. Mass.574.907
SMILESCOC1CN(C1)C(=O)c1ccc2c(cn(C(=O)c3c(Cl)cccc3C(F)(F)F)c2c1)-c1ccc(cc1F)C(O)=O