Reaction Details
TargetCoagulation factor VII
LigandBDBM13592
Substrate/CompetitorBDBM13553
Meas. Tech.Serine Protease Inhibition Assay
pH7.8±n/a
Temperature295.15±n/a K
Ki 10±n/a nM
Citation Groebke Zbinden, KBanner, DWHilpert, KHimber, JLave, TRiederer, MAStahl, MTschopp, TBObst-Sander, U Dose-dependent antithrombotic activity of an orally active tissue factor/factor VIIa inhibitor without concomitant enhancement of bleeding propensity. Bioorg Med Chem14:5357-69 (2006) 
 
Coagulation factor VII
Name:Coagulation factor VII
Type:Enzyme
Mol. Mass.:51599.89
Organism:Homo sapiens (Human)
Description:n/a
Residue:466
BDBM13592
BDBM13553
NameBDBM13592
Synonyms:2-{2-[(4-carbamimidoylphenyl)carbamoyl]-6-methoxypyridin-3-yl}-5-{[(2S)-1-hydroxy-3,3-dimethylbutan-2-yl]carbamoyl}benzoic acid | Ono Compound 8
TypeSmall organic molecule
Emp. Form.C28H31N5O6
Mol. Mass.533.5756
SMILESCOc1ccc(-c2ccc(cc2C(O)=O)C(=O)N[C@H](CO)C(C)(C)C)c(n1)C(=O)Nc1ccc(cc1)C(N)=N