Reaction Details
Target11-beta-hydroxysteroid dehydrogenase 1
LigandBDBM13746
Substrate/CompetitorBDBM13739
Meas. Tech.Human and Mouse 11beta-HSD1 SPA Assay
pH7.2±n/a
Temperature295.15±n/a K
Ki 3±1 nM
Citation Jean, DJYuan, CBercot, EACupples, RChen, MFretland, JHale, CHungate, RWKomorowski, RVeniant, MWang, MZhang, XFotsch, C 2-(S)-phenethylaminothiazolones as potent, orally efficacious inhibitors of 11beta-hydroxysteriod dehydrogenase type 1. J Med Chem50:429-32 (2007) 
 
11-beta-hydroxysteroid dehydrogenase 1
Name:11-beta-hydroxysteroid dehydrogenase 1
Type:Enzyme
Mol. Mass.:32409.16
Organism:Homo sapiens (Human)
Description:P28845
Residue:292
BDBM13746
BDBM13739
NameBDBM13746
Synonyms:2-((S)-1-(2-fluorophenyl)ethylamino)-5-isopropyl-5-methylthiazol-4(5H)-one 2-{[(1S)-1-(2-fluorophenyl)ethyl]amino}-5-methyl-5-(propan-2-yl)-4,5-dihydro-1,3-thiazol-4-one
TypeSmall organic molecule
Emp. Form.C15H19FN2OS
Mol. Mass.294.388
SMILESCC(C)C1(C)SC(N[C@@H](C)c2ccccc2F)=NC1=O