Reaction Details
TargetNuclear receptor ROR-gamma
LigandBDBM338335
Substrate/Competitorn/a
Meas. Tech.Binding Assay
IC50 5.00±n/a nM
Citation Fauber, BGobbi, ARene, Ovan Niel, MBGancia, EGaines, SLadduwahetty, TVesey, DWard, SWinship, P Aryl sultam derivatives as RORc modulators US Patent US9751873 Publication Date 9/5/2017
 
Nuclear receptor ROR-gamma
Name:Nuclear receptor ROR-gamma
Type:Enzyme Catalytic Domain
Mol. Mass.:58218.40
Organism:Homo sapiens (Human)
Description:P51449
Residue:518
BDBM338335
NameBDBM338335
Synonyms:(1R,5S,6S)-3-[2,5-Difluoro-4- ((3S,6R)-3-methyl-1,1-dioxo-6- phenyl-[1,2]thiazinan-2-ylmethyl)- phenyl]-6-[1,2,4]triazol-4-yl-3-aza- bicyclo[3.1.0]hexane | US9751873, Example 21
TypeSmall organic molecule
Emp. Form.C25H27F2N5O2S
Mol. Mass.499.576
SMILESC[C@H]1CC[C@H](c2ccccc2)S(=O)(=O)N1Cc1cc(F)c(cc1F)N1C[C@H]2[C@@H](C1)C2n1cnnc1