Reaction Details
TargetNuclear receptor ROR-gamma
LigandBDBM338397
Substrate/Competitorn/a
Meas. Tech.Binding Assay
IC50 13.9±n/a nM
Citation Fauber, BGobbi, ARene, Ovan Niel, MBGancia, EGaines, SLadduwahetty, TVesey, DWard, SWinship, P Aryl sultam derivatives as RORc modulators US Patent US9751873 Publication Date 9/5/2017
 
Nuclear receptor ROR-gamma
Name:Nuclear receptor ROR-gamma
Type:Enzyme Catalytic Domain
Mol. Mass.:58218.40
Organism:Homo sapiens (Human)
Description:P51449
Residue:518
BDBM338397
NameBDBM338397
Synonyms:(3S,6R)-2-[[2-fluoro-4-[(3R,4R)-3- fluoro-4-(1,2,4-triazol-4-yl)-1- piperidyl]phenyl]methyl]-3-methyl- 6-phenyl-thiazinane 1,1-dioxide US9751873, Example 94
TypeSmall organic molecule
Emp. Form.C25H29F2N5O2S
Mol. Mass.501.592
SMILESC[C@H]1CC[C@H](c2ccccc2)S(=O)(=O)N1Cc1ccc(cc1F)N1CC[C@H]([C@H](F)C1)n1cnnc1