Reaction Details
TargetNuclear receptor ROR-gamma
LigandBDBM338400
Substrate/Competitorn/a
Meas. Tech.Binding Assay
IC50 6.90±n/a nM
Citation Fauber, BGobbi, ARene, Ovan Niel, MBGancia, EGaines, SLadduwahetty, TVesey, DWard, SWinship, P Aryl sultam derivatives as RORc modulators US Patent US9751873 Publication Date 9/5/2017
 
Nuclear receptor ROR-gamma
Name:Nuclear receptor ROR-gamma
Type:Enzyme Catalytic Domain
Mol. Mass.:58218.40
Organism:Homo sapiens (Human)
Description:P51449
Residue:518
BDBM338400
NameBDBM338400
Synonyms:8-[3-fluoro-4-[[3S,6R)-3-methyl- 1,1-dioxo-6-phenyl-thiazinan-2- yl]methyl]phenyl]-1,3-dimethyl- 1,3,8-triazaspiro[4.5]decane-2,4- dione | US9751873, Example 88
TypeSmall organic molecule
Emp. Form.C28H34FN3O4S
Mol. Mass.527.651
SMILESC[C@H]1CC[C@H](c2ccccc2)S(=O)(=O)C1Cc1ccc(cc1F)N1CCC2(CC1)N(C)C(=O)N(C)C2=O