Reaction Details
TargetNuclear receptor ROR-gamma
LigandBDBM338466
Substrate/Competitorn/a
Meas. Tech.Binding Assay
IC50 4.00±n/a nM
Citation Fauber, BGobbi, ARene, Ovan Niel, MBGancia, EGaines, SLadduwahetty, TVesey, DWard, SWinship, P Aryl sultam derivatives as RORc modulators US Patent US9751873 Publication Date 9/5/2017
 
Nuclear receptor ROR-gamma
Name:Nuclear receptor ROR-gamma
Type:Enzyme Catalytic Domain
Mol. Mass.:58218.40
Organism:Homo sapiens (Human)
Description:P51449
Residue:518
BDBM338466
NameBDBM338466
Synonyms:(7R)-2-[[2,5-difluoro-4-[4-(1,2,4- triazol-4-yl)-1- piperidyl]phenyl]methyl]-7-phenyl- thiazepane 1,1-dioxide | US9751873, Example 153
TypeSmall organic molecule
Emp. Form.C25H29F2N5O2S
Mol. Mass.501.592
SMILESFc1cc(N2CCC(CC2)n2cnnc2)c(F)cc1CN1CCCC[C@H](c2ccccc2)S1(=O)=O