Reaction Details
TargetPhosphatidylinositol 4,5-bisphosphate 3-kinase catalytic subunit delta isoform
LigandBDBM341211
Substrate/Competitorn/a
Meas. Tech.TR-FRET assay
IC50 0.500±n/a nM
Citation Evarts, JKaplan, JKim, MNaduthambi, DPatel, LPerreault, SPhillips, GPurvis, II, LJStevens, KLTreiberg, JA Phosphatidylinositol 3-kinase inhibitors US Patent US9765060 Publication Date 9/19/2017
 
Phosphatidylinositol 4,5-bisphosphate 3-kinase catalytic subunit delta isoform
Name:Phosphatidylinositol 4,5-bisphosphate 3-kinase catalytic subunit delta isoform
Type:Enzyme Subunit
Mol. Mass.:119489.41
Organism:Homo sapiens (Human)
Description:O00329
Residue:1044
BDBM341211
NameBDBM341211
Synonyms:(S)-3-(2-(1-((2,6-diamino-5-cyanopyrimidin-4-yl)amino)ethyl)-8-fluoro-4-oxo-3-phenyl-3,4-dihydroquinazoline-5-yl)propanamide | US9765060, Compound 38
TypeSmall organic molecule
Emp. Form.C24H22FN9O2
Mol. Mass.487.489
SMILESC[C@H](Nc1nc(N)nc(N)c1C#N)c1nc2c(F)ccc(CCC(N)=O)c2c(=O)n1-c1ccccc1