Reaction Details
TargetPhosphatidylinositol 4,5-bisphosphate 3-kinase catalytic subunit delta isoform
LigandBDBM341226
Substrate/Competitorn/a
Meas. Tech.TR-FRET assay
IC50 0.700±n/a nM
Citation Evarts, JKaplan, JKim, MNaduthambi, DPatel, LPerreault, SPhillips, GPurvis, II, LJStevens, KLTreiberg, JA Phosphatidylinositol 3-kinase inhibitors US Patent US9765060 Publication Date 9/19/2017
 
Phosphatidylinositol 4,5-bisphosphate 3-kinase catalytic subunit delta isoform
Name:Phosphatidylinositol 4,5-bisphosphate 3-kinase catalytic subunit delta isoform
Type:Enzyme Subunit
Mol. Mass.:119489.41
Organism:Homo sapiens (Human)
Description:O00329
Residue:1044
BDBM341226
NameBDBM341226
Synonyms:(S)-2,4-diamino-6-((1-(5-(3-(3,3-dimethylmorpholino)propyl)-4-oxo-3-phenyl-3,4-dihydroquinazolin-2-yl)ethyl)amino)pyrimidine-5-carbonitrile | US9765060, Compound 53
TypeSmall organic molecule
Emp. Form.C30H35N9O2
Mol. Mass.553.658
SMILESC[C@H](Nc1nc(N)nc(N)c1C#N)c1nc2cccc(CCCN3CCOCC3(C)C)c2c(=O)n1-c1ccccc1