Reaction Details
TargetRibosomal protein S6 kinase alpha-1
LigandBDBM342166
Substrate/Competitorn/a
Meas. Tech.Kinase Assay
IC50 23.6±0.0 nM
Citation Dunn, SEJayanthan, ANagireddy, JRAnnedi, SVan Drie, JHDaynard, TSHuynh, M Substituted tetrahydropyrido[3′,2′:4,5]pyrrolo[1,2-a]pyrazine-2-carboxamides as RSK inhibitors US Patent US9771366 Publication Date 9/26/2017
 
Ribosomal protein S6 kinase alpha-1
Name:Ribosomal protein S6 kinase alpha-1
Type:Serine/threonine-protein kinase
Mol. Mass.:82736.10
Organism:Homo sapiens (Human)
Description:n/a
Residue:735
BDBM342166
NameBDBM342166
Synonyms:(R)-1-benzyl-N-(9-methyl-6-oxo-6,7,8,9-tetrahydropyrido[3',2':4,5]pyrrolo[1,2-a]pyrazin-2-yl)-1H-pyrazole-4-carboxamide | US9771366, Compound 15
TypeSmall organic molecule
Emp. Form.C23H21N5O2
Mol. Mass.399.4451
SMILESC[C@@H]1CNC(=O)c2cc3cc(NC(=O)c4cnn(Cc5ccccc5)c4)ccc3n12