Reaction Details
TargetcGMP-specific 3',5'-cyclic phosphodiesterase
LigandBDBM14393
Substrate/CompetitorBDBM14391
Meas. Tech.PDE Enzyme Inhibitor Assays
pH7.4±n/a
Temperature303.15±n/a K
IC50 5.5±n/a nM
CommentscGMP in a 3:1 ratio unlabeled to 3H-labeled at a concentration 1/3Km, such that IC50 = Ki.
Citation Allerton, CMBarber, CGBeaumont, KCBrown, DGCole, SMEllis, DLane, CAMaw, GNMount, NMRawson, DJRobinson, CMStreet, SDSummerhill, NW A novel series of potent and selective PDE5 inhibitors with potential for high and dose-independent oral bioavailability. J Med Chem49:3581-94 (2006) 
 
cGMP-specific 3',5'-cyclic phosphodiesterase
Name:cGMP-specific 3',5'-cyclic phosphodiesterase
Type:Protein
Mol. Mass.:99975.83
Organism:Homo sapiens (Human)
Description:O76074
Residue:875
BDBM14393
BDBM14391
NameBDBM14393
Synonyms:5-(2-butoxy-5-acetylpyridin-3-yl)-3-ethyl-2-(1-ethylazetidin-3-yl)-2H,6H,7H-pyrazolo[4,3-d]pyrimidin-7-one Sildenafil 5-methyl ketone analogue 2
TypeSmall organic molecule
Emp. Form.C23H30N6O3
Mol. Mass.438.5227
SMILESCCCCOc1ncc(cc1-c1nc2c(CC)n(nc2c(=O)[nH]1)C1CN(CC)C1)C(C)=O