Reaction Details
TargetcGMP-specific 3',5'-cyclic phosphodiesterase
LigandBDBM14407
Substrate/CompetitorBDBM14391
Meas. Tech.PDE Enzyme Inhibitor Assays
IC50 2.6±n/a nM
Citation Allerton, CMBarber, CGBeaumont, KCBrown, DGCole, SMEllis, DLane, CAMaw, GNMount, NMRawson, DJRobinson, CMStreet, SDSummerhill, NW A novel series of potent and selective PDE5 inhibitors with potential for high and dose-independent oral bioavailability. J Med Chem49:3581-94 (2006) 
 
cGMP-specific 3',5'-cyclic phosphodiesterase
Name:cGMP-specific 3',5'-cyclic phosphodiesterase
Type:Protein
Mol. Mass.:99975.83
Organism:Homo sapiens (Human)
Description:O76074
Residue:875
BDBM14407
BDBM14391
NameBDBM14407
Synonyms:5-(2-butoxy-5-acetylpyridin-3-yl)-3-ethyl-2-[2-(morpholin-4-yl)ethyl]-2H,6H,7H-pyrazolo[4,3-d]pyrimidin-7-one Sildenafil 5-methyl ketone analogue 16
TypeSmall organic molecule
Emp. Form.C24H32N6O4
Mol. Mass.468.5487
SMILESCCCCOc1ncc(cc1-c1nc2c(CC)n(CCN3CCOCC3)nc2c(=O)[nH]1)C(C)=O