Reaction Details
TargetSerine protease 1
LigandBDBM14333
Substrate/CompetitorBDBM12679
Meas. Tech.Enzyme Assay and Determination of the Inhibition Constants
pH7.4±n/a
Temperature295.15±n/a K
Ki 10000±n/a nM
Citation Katz, BALuong, CHo, JDSomoza, JRGjerstad, ETang, JWilliams, SRVerner, EMackman, RLYoung, WBSprengeler, PAChan, HMortara, KJanc, JWMcGrath, ME Dissecting and designing inhibitor selectivity determinants at the S1 site using an artificial Ala190 protease (Ala190 uPA). J Mol Biol344:527-47 (2004) 
 
Serine protease 1
Name:Serine protease 1
Type:Enzyme
Mol. Mass.:26557.80
Organism:Homo sapiens (Human)
Description:P07477
Residue:247
BDBM14333
BDBM12679
NameBDBM14333
Synonyms:2-{5-[amino(iminiumyl)methyl]-6-fluoro-1H-1,3-benzodiazol-2-yl}-6-phenylbenzen-1-olate CRA-10818
TypeSmall organic molecule
Emp. Form.C20H15FN4O
Mol. Mass.346.3577
SMILESNC(=[NH2+])c1cc2nc([nH]c2cc1F)-c1cccc(-c2ccccc2)c1[O-]