Reaction Details
TargetSerine protease 1
LigandBDBM14481
Substrate/CompetitorBDBM12679
Meas. Tech.Enzyme Assay and Determination of the Inhibition Constants
pH7.4±n/a
Temperature295.15±n/a K
Ki 42000±n/a nM
Citation Katz, BALuong, CHo, JDSomoza, JRGjerstad, ETang, JWilliams, SRVerner, EMackman, RLYoung, WBSprengeler, PAChan, HMortara, KJanc, JWMcGrath, ME Dissecting and designing inhibitor selectivity determinants at the S1 site using an artificial Ala190 protease (Ala190 uPA). J Mol Biol344:527-47 (2004) 
 
Serine protease 1
Name:Serine protease 1
Type:Enzyme
Mol. Mass.:26557.80
Organism:Homo sapiens (Human)
Description:P07477
Residue:247
BDBM14481
BDBM12679
NameBDBM14481
Synonyms:CA-23 | [amino({5-[(3,4-dihydroxynaphthalene-2-)amido]pyridin-2-yl}amino)methylidene]azanium
TypeSmall organic molecule
Emp. Form.C17H16N5O3
Mol. Mass.338.3401
SMILES[#7]\[#6](-[#7])=[#7+]/c1ccc(-[#7]-[#6](=O)-c2cc3ccccc3c(-[#8])c2-[#8])cn1