Reaction Details
TargetTryptase beta-2
LigandBDBM14333
Substrate/CompetitorBDBM12679
Meas. Tech.Enzyme Assay and Determination of the Inhibition Constants
Ki 4700±n/a nM
Citation Katz, BALuong, CHo, JDSomoza, JRGjerstad, ETang, JWilliams, SRVerner, EMackman, RLYoung, WBSprengeler, PAChan, HMortara, KJanc, JWMcGrath, ME Dissecting and designing inhibitor selectivity determinants at the S1 site using an artificial Ala190 protease (Ala190 uPA). J Mol Biol344:527-47 (2004) 
 
Tryptase beta-2
Name:Tryptase beta-2
Type:PROTEIN
Mol. Mass.:30518.79
Organism:Homo sapiens (Human)
Description:ChEMBL_210702
Residue:275
BDBM14333
BDBM12679
NameBDBM14333
Synonyms:2-{5-[amino(iminiumyl)methyl]-6-fluoro-1H-1,3-benzodiazol-2-yl}-6-phenylbenzen-1-olate CRA-10818
TypeSmall organic molecule
Emp. Form.C20H15FN4O
Mol. Mass.346.3577
SMILESNC(=[NH2+])c1cc2nc([nH]c2cc1F)-c1cccc(-c2ccccc2)c1[O-]