Reaction Details
TargetTryptase beta-2
LigandBDBM14480
Substrate/CompetitorBDBM12679
Meas. Tech.Enzyme Assay and Determination of the Inhibition Constants
Ki 2000±n/a nM
Citation Katz, BALuong, CHo, JDSomoza, JRGjerstad, ETang, JWilliams, SRVerner, EMackman, RLYoung, WBSprengeler, PAChan, HMortara, KJanc, JWMcGrath, ME Dissecting and designing inhibitor selectivity determinants at the S1 site using an artificial Ala190 protease (Ala190 uPA). J Mol Biol344:527-47 (2004) 
 
Tryptase beta-2
Name:Tryptase beta-2
Type:PROTEIN
Mol. Mass.:30518.79
Organism:Homo sapiens (Human)
Description:ChEMBL_210702
Residue:275
BDBM14480
BDBM12679
NameBDBM14480
Synonyms:CA-22 | [amino({4-[(3-hydroxynaphthalene-2-)amido]phenyl}amino)methylidene]azanium
TypeSmall organic molecule
Emp. Form.C18H17N4O2
Mol. Mass.321.3526
SMILES[#7]\[#6](-[#7])=[#7+]/c1ccc(-[#7]-[#6](=O)-c2cc3ccccc3cc2-[#8])cc1